Reaction Details
TargetNeprilysin
LigandBDBM50403258
Substrate/Competitorn/a
Meas. Tech.ChEMBL_144627 (CHEMBL883549)
IC50 2.4±n/a nM
Citation Robl, JASimpkins, LMStevenson, JSun, CMurugesan, NBarrish, JCAsaad, MMBird, JSchaeffer, TRTrippodo, NCPetrillo, EWKaranewsky, DS Dual metalloprotease inhibitors. I. constrained peptidomimetics of mercaptoacyl dipeptides Bioorg Med Chem Lett4:1789-1794 (1994)    Article
 
Neprilysin
Name:Neprilysin
Type:Enzyme
Mol. Mass.:85505.38
Organism:Homo sapiens (Human)
Description:P08473
Residue:750
BDBM50403258
NameBDBM50403258
Synonyms:CHEMBL301364
TypeSmall organic molecule
Emp. Form.C22H24N2O4S
Mol. Mass.412.502
SMILESOC(=O)CCN1c2ccccc2CC[C@H](NC(=O)[C@@H](S)Cc2ccccc2)C1=O