Reaction Details
TargetAngiotensin-converting enzyme
LigandBDBM50403261
Substrate/Competitorn/a
Meas. Tech.ChEMBL_35584 (CHEMBL648282)
IC50 4.8±n/a nM
Citation Robl, JASimpkins, LMStevenson, JSun, CMurugesan, NBarrish, JCAsaad, MMBird, JSchaeffer, TRTrippodo, NCPetrillo, EWKaranewsky, DS Dual metalloprotease inhibitors. I. constrained peptidomimetics of mercaptoacyl dipeptides Bioorg Med Chem Lett4:1789-1794 (1994)    Article
 
Angiotensin-converting enzyme
Name:Angiotensin-converting enzyme
Type:Enzyme
Mol. Mass.:149709.01
Organism:Homo sapiens (Human)
Description:n/a
Residue:1306
BDBM50403261
NameBDBM50403261
Synonyms:CHEMBL51498
TypeSmall organic molecule
Emp. Form.C22H24N2O4S
Mol. Mass.412.502
SMILESOC(=O)CN1c2ccccc2CC[C@H](NC(=O)[C@@H](CS)Cc2ccccc2)C1=O