Reaction Details
TargetAngiotensin-converting enzyme
LigandBDBM50403266
Substrate/Competitorn/a
Meas. Tech.ChEMBL_35983 (CHEMBL645286)
IC50 6.3±n/a nM
Citation Robl, JASimpkins, LMSulsky, RSieber-McMaster, EStevenson, JKelly, YFSun, CMisra, RNRyono, DEAsaad, MMBird, JTrippodo, NCKaranewsky, DS Dual metalloprotease inhibitors. II. Effect of substitution and stereochemistry on benzazepinone based mercaptoacetyls Bioorg Med Chem Lett4:1795-1800 (1994)    Article
 
Angiotensin-converting enzyme
Name:Angiotensin-converting enzyme
Type:Enzyme
Mol. Mass.:149709.01
Organism:Homo sapiens (Human)
Description:n/a
Residue:1306
BDBM50403266
NameBDBM50403266
Synonyms:CHEMBL415932
TypeSmall organic molecule
Emp. Form.C18H24N2O4S
Mol. Mass.364.459
SMILESCC(C)C[C@H](S)C(=O)N[C@H]1CCc2ccccc2N(CC(O)=O)C1=O