Reaction Details
TargetNeprilysin
LigandBDBM50403280
Substrate/Competitorn/a
Meas. Tech.ChEMBL_144628 (CHEMBL752986)
IC50 3±n/a nM
Citation Robl, JASun, CSimpkins, LMRyono, DEBarrish, JCKaranewsky, DSAsaad, MMSchaeffer, TRTrippodo, NC Dual metalloprotease inhibitors. III. utilization of bicyclic and monocyclic diazepinone based mercaptoacetyls Bioorg Med Chem Lett4:2055-2060 (1994)    Article
 
Neprilysin
Name:Neprilysin
Type:Enzyme
Mol. Mass.:85505.38
Organism:Homo sapiens (Human)
Description:P08473
Residue:750
BDBM50403280
NameBDBM50403280
Synonyms:CHEMBL65545
TypeSmall organic molecule
Emp. Form.C19H25N3O4S
Mol. Mass.391.484
SMILESOC(=O)[C@@H]1CCCN2CCC[C@H](NC(=O)[C@@H](S)Cc3ccccc3)C(=O)N12