Reaction Details
TargetGag-Pol polyprotein [489-587]
LigandBDBM50403344
Substrate/Competitorn/a
Meas. Tech.ChEBML_157883
Ki 2000±n/a nM
Citation Thompson, SKEppley, AMFrazee, JSDarcy, MGLum, RTTomaszek, TAIvanoff, LAMorris, JFSternberg, EJLambert, DMFernandez, AVPetteway, SRMeek, TDMetcalf, BWGleason, JG Synthesis and antiviral activity of a novel class of HIV-1 protease inhibitors containing a heterocyclic P1-P2 amide bond isostere Bioorg Med Chem Lett4:2441-2446 (1994)    Article
 
Gag-Pol polyprotein [489-587]
Name:Gag-Pol polyprotein [489-587]
Type:Enzyme Subunit
Mol. Mass.:10781.16
Organism:Human immunodeficiency virus type 1
Description:P04585[489-587]
Residue:99
BDBM50403344
NameBDBM50403344
Synonyms:CHEMBL83384
TypeSmall organic molecule
Emp. Form.C28H36N2O3S
Mol. Mass.480.662
SMILESCCc1cnc(s1)[C@@H](C[C@H](O)[C@H](Cc1ccccc1)NC(=O)OC(C)(C)C)Cc1ccccc1