Reaction Details
TargetGag-Pol polyprotein [489-587]
LigandBDBM50403356
Substrate/Competitorn/a
Meas. Tech.ChEBML_157883
Ki 300±n/a nM
Citation Thompson, SKEppley, AMFrazee, JSDarcy, MGLum, RTTomaszek, TAIvanoff, LAMorris, JFSternberg, EJLambert, DMFernandez, AVPetteway, SRMeek, TDMetcalf, BWGleason, JG Synthesis and antiviral activity of a novel class of HIV-1 protease inhibitors containing a heterocyclic P1-P2 amide bond isostere Bioorg Med Chem Lett4:2441-2446 (1994)    Article
 
Gag-Pol polyprotein [489-587]
Name:Gag-Pol polyprotein [489-587]
Type:Enzyme Subunit
Mol. Mass.:10781.16
Organism:Human immunodeficiency virus type 1
Description:P04585[489-587]
Residue:99
BDBM50403356
NameBDBM50403356
Synonyms:CHEMBL430437
TypeSmall organic molecule
Emp. Form.C34H48N4O4
Mol. Mass.576.7693
SMILESCC(C)[C@H](NC(=O)OC(C)(C)C)C(=O)N[C@@H](Cc1ccccc1)[C@@H](O)C[C@@H](Cc1ccccc1)c1ncc([nH]1)C(C)C