Reaction Details
TargetGag-Pol polyprotein [489-587]
LigandBDBM50403357
Substrate/Competitorn/a
Meas. Tech.ChEBML_157883
Ki 1±n/a nM
Citation Thompson, SKEppley, AMFrazee, JSDarcy, MGLum, RTTomaszek, TAIvanoff, LAMorris, JFSternberg, EJLambert, DMFernandez, AVPetteway, SRMeek, TDMetcalf, BWGleason, JG Synthesis and antiviral activity of a novel class of HIV-1 protease inhibitors containing a heterocyclic P1-P2 amide bond isostere Bioorg Med Chem Lett4:2441-2446 (1994)    Article
 
Gag-Pol polyprotein [489-587]
Name:Gag-Pol polyprotein [489-587]
Type:Enzyme Subunit
Mol. Mass.:10781.16
Organism:Human immunodeficiency virus type 1
Description:P04585[489-587]
Residue:99
BDBM50403357
NameBDBM50403357
Synonyms:CHEMBL419286
TypeSmall organic molecule
Emp. Form.C31H42N4O3
Mol. Mass.518.6902
SMILESCC(C)[C@H](NC(C)=O)C(=O)N[C@@H](Cc1ccccc1)[C@@H](O)C[C@@H](Cc1ccccc1)c1ncc([nH]1)C(C)C