Reaction Details
TargetMuscarinic acetylcholine receptor M4
LigandBDBM50403485
Substrate/Competitorn/a
Meas. Tech.ChEMBL_139264 (CHEMBL745072)
Ki 4.7±n/a nM
Citation Tumiatti, VSanti, SRecanatini, MMinarini, AMelchiorre, CChiarini, ABudriesi, R Design, synthesis and biological activity of some 4-DAMP- related compounds Bioorg Med Chem Lett5:2325-2330 (1995)    Article
 
Muscarinic acetylcholine receptor M4
Name:Muscarinic acetylcholine receptor M4
Type:Enzyme Catalytic Domain
Mol. Mass.:53079.31
Organism:Homo sapiens (Human)
Description:Cholinergic, muscarinic M4 CHRM4 HUMAN M3::P08173
Residue:479
BDBM50403485
NameBDBM50403485
Synonyms:CHEMBL292857
TypeSmall organic molecule
Emp. Form.C23H26NO3
Mol. Mass.364.4569
SMILESC[N+]1(C)C2CCC1CC1(C2)OC(=O)C(O1)(c1ccccc1)c1ccccc1