Reaction Details
TargetMuscarinic acetylcholine receptor M2
LigandBDBM50403484
Substrate/Competitorn/a
Meas. Tech.ChEMBL_140116 (CHEMBL858424)
Ki 2.8±n/a nM
Citation Tumiatti, VSanti, SRecanatini, MMinarini, AMelchiorre, CChiarini, ABudriesi, R Design, synthesis and biological activity of some 4-DAMP- related compounds Bioorg Med Chem Lett5:2325-2330 (1995)    Article
 
Muscarinic acetylcholine receptor M2
Name:Muscarinic acetylcholine receptor M2
Type:Enzyme Catalytic Domain
Mol. Mass.:51555.53
Organism:RAT
Description:P10980
Residue:466
BDBM50403484
NameBDBM50403484
Synonyms:CHEMBL306182
TypeSmall organic molecule
Emp. Form.C21H24NO3
Mol. Mass.338.4196
SMILESC[N+]1(C)CCC2(CC1)OC(=O)C(O2)(c1ccccc1)c1ccccc1