Reaction Details
TargetHistamine H3 receptor
LigandBDBM22914
Substrate/Competitorn/a
Meas. Tech.ChEBML_83828
Ki 4±n/a nM
Citation Huls, APurand, KStark, HLigneau, XArrang, JSchwartz, JSchunack, W Diphenylmethyl ethers: synthesis and histamine H3-receptor antagonist in vitro and in vivo activity Bioorg Med Chem Lett6:2013-2018 (1996)    Article
 
Histamine H3 receptor
Name:Histamine H3 receptor
Type:G Protein-Coupled Receptor (GPCR)
Mol. Mass.:48607.98
Organism:Rattus norvegicus (rat)
Description:n/a
Residue:445
BDBM22914
NameBDBM22914
Synonyms:CHEMBL260374 Thioperamide | US11622967, Compound Thioperamide
TypeSmall organic molecule
Emp. Form.C15H24N4S
Mol. Mass.292.443
SMILESS=C(NC1CCCCC1)N1CCC(CC1)c1cnc[nH]1