Reaction Details
TargetHistamine H3 receptor
LigandBDBM22541
Substrate/Competitorn/a
Meas. Tech.ChEBML_83828
Ki 0.630957±n/a nM
Citation Huls, APurand, KStark, HLigneau, XArrang, JSchwartz, JSchunack, W Diphenylmethyl ethers: synthesis and histamine H3-receptor antagonist in vitro and in vivo activity Bioorg Med Chem Lett6:2013-2018 (1996)    Article
 
Histamine H3 receptor
Name:Histamine H3 receptor
Type:G Protein-Coupled Receptor (GPCR)
Mol. Mass.:48607.98
Organism:Rattus norvegicus (rat)
Description:n/a
Residue:445
BDBM22541
NameBDBM22541
Synonyms:Clobenpropit VUF 9153 VUF9153
TypeSmall organic molecule
Emp. Form.C14H17ClN4S
Mol. Mass.308.83
SMILESNC(SCCCc1cnc[nH]1)=NCc1ccc(Cl)cc1