Reaction Details
TargetD(2) dopamine receptor
LigandBDBM50403649
Substrate/Competitorn/a
Meas. Tech.ChEBML_60939
Ki 8318±n/a nM
Citation Minarini, ABudriesi, RChiarini, ALeonardi, AMelchiorre, C Search for alpha 1-adrenoceptor subtypes selective antagonists: design, synthesis and biological activity of cystazosin, an alpha 1D-adrenoceptor antagonist. Bioorg Med Chem Lett8:1353-8 (1999) D(2) dopamine receptor
Name:D(2) dopamine receptor
Type:G Protein-Coupled Receptor (GPCR)
Mol. Mass.:50931.60
Organism:Rattus norvegicus (rat)
Description:P61169
Residue:444
BDBM50403649
NameBDBM50403649
Synonyms:CYCLAZOSIN
TypeSmall organic molecule
Emp. Form.C23H27N5O4
Mol. Mass.437.4916
SMILESCOc1cc2nc(nc(N)c2cc1OC)N1CCN([C@H]2CCCC[C@@H]12)C(=O)c1ccco1