Reaction Details
Target5-hydroxytryptamine receptor 1A
LigandBDBM50039824
Substrate/Competitorn/a
Meas. Tech.ChEMBL_1518 (CHEMBL616152)
Ki 0.295121±n/a nM
Citation van Steen, BJvan Wijngaarden, IRonken, ESoudijn, W Functional characteristics of a series of N4-substituted 1-(2,3-dihydro-1,4-benzodioxin-5-yl)piperazines as 5-HT1A receptor ligands. Structure-activity relationships. Bioorg Med Chem Lett8:2457-62 (1999) 5-hydroxytryptamine receptor 1A
Name:5-hydroxytryptamine receptor 1A
Type:G Protein-Coupled Receptor (GPCR)
Mol. Mass.:46445.29
Organism:Rattus norvegicus (rat)
Description:Binding assays were performed using rat hippocampal membranes.
Residue:422
BDBM50039824
NameBDBM50039824
Synonyms:CHEMBL81728 | N-{2-[4-(2,3-Dihydro-benzo[1,4]dioxin-5-yl)-piperazin-1-yl]-ethyl}-4-fluoro-benzamide
TypeSmall organic molecule
Emp. Form.C21H24FN3O3
Mol. Mass.385.432
SMILESFc1ccc(cc1)C(=O)NCCN1CCN(CC1)c1cccc2OCCOc12