Reaction Details
Target5-hydroxytryptamine receptor 2A
LigandBDBM50403683
Substrate/Competitorn/a
Meas. Tech.ChEMBL_226359 (CHEMBL858013)
Ki 1.6±n/a nM
Citation Masaguer, CFFormoso, ERaviña, ETristán, HLoza, MIRivas, EFontenla, JA Butyrophenone analogues in the carbazole series: synthesis and determination of affinities at D2 and 5-HT2A receptors. Bioorg Med Chem Lett8:3571-6 (1999) 5-hydroxytryptamine receptor 2A
Name:5-hydroxytryptamine receptor 2A
Type:G Protein-Coupled Receptor (GPCR)
Mol. Mass.:52852.05
Organism:Rattus norvegicus (rat)
Description:Rat cortex membranes 5-HT2A receptors.
Residue:471
BDBM50403683
NameBDBM50403683
Synonyms:CHEMBL333174
TypeSmall organic molecule
Emp. Form.C25H24FN3O2
Mol. Mass.417.4754
SMILESFc1ccc2c(noc2c1)C1CCN(CC2Cc3[nH]c4ccccc4c3C(=O)C2)CC1