Reaction Details
TargetNeuronal acetylcholine receptor subunit alpha-4/beta-2
LigandBDBM50088631
Substrate/Competitorn/a
Meas. Tech.ChEMBL_143710 (CHEMBL857696)
IC50 103±n/a nM
Citation Lee, JDavis, CBRivero, RAReitz, ABShank, RP Synthesis and structure-activity relationship of novel pyridyl ethers for the nicotinic acetylcholine receptor. Bioorg Med Chem Lett10:1063-6 (2000) Neuronal acetylcholine receptor subunit alpha-4/beta-2
Name:Neuronal acetylcholine receptor subunit alpha-4/beta-2
Type:n/a
Mol. Mass.:n/a
Description:n/a
Components:This complex has 0 components.
Component 1
Name:Neuronal acetylcholine receptor subunit alpha-4
Synonyms:ACHA4_RAT Cholinergic, Nicotinic Alpha4Beta2 Chrna4 Neuronal acetylcholine receptor (alpha4beta2 nAChR) Neuronal acetylcholine receptor subunit alpha 4 beta 2 | Neuronal acetylcholine receptor subunit alpha-4
Type:Enzyme
Mol. Mass.:70196.44
Organism:Rattus norvegicus (Rat)
Description:P09483
Residue:630
Component 2
Name:Neuronal acetylcholine receptor subunit beta-2
Synonyms:ACHB2_RAT Chrnb2 Neuronal acetylcholine receptor non-alpha-1 chain
Type:Enzyme
Mol. Mass.:56910.32
Organism:Rattus norvegicus (Rat)
Description:P12390
Residue:500
BDBM50088631
NameBDBM50088631
Synonyms:2-Chloro-3-(3-chloro-phenyl)-5-((R)-pyrrolidin-3-yloxy)-pyridine | CHEMBL10171
TypeSmall organic molecule
Emp. Form.C15H14Cl2N2O
Mol. Mass.309.19
SMILESClc1cccc(c1)-c1cc(O[C@@H]2CCNC2)cnc1Cl