Reaction Details
Target5-hydroxytryptamine receptor 7
LigandBDBM50403780
Substrate/Competitorn/a
Meas. Tech.ChEMBL_3724 (CHEMBL619896)
Ki 2±n/a nM
Citation López-Rodríguez, MLPorras, EBenhamú, BRamos, JAMorcillo, MJLavandera, JL First pharmacophoric hypothesis for 5-HT7 antagonism. Bioorg Med Chem Lett10:1097-100 (2000) 5-hydroxytryptamine receptor 7
Name:5-hydroxytryptamine receptor 7
Type:G Protein-Coupled Receptor (GPCR)
Mol. Mass.:53573.08
Organism:Homo sapiens (Human)
Description:P34969
Residue:479
BDBM50403780
NameBDBM50403780
Synonyms:CHEMBL12846
TypeSmall organic molecule
Emp. Form.C26H32N2O
Mol. Mass.388.5451
SMILESO=C1Nc2cccc3CCCC1(CCCCN1CCC(CC1)c1ccccc1)c23