Reaction Details
TargetProtein c-Fos/Transcription factor Jun
LigandBDBM50090450
Substrate/Competitorn/a
Meas. Tech.ChEMBL_92286 (CHEMBL705832)
IC50 300±n/a nM
Citation Palanki, MSErdman, PEManning, AMOw, ARansone, LJSpooner, CSuto, CSuto, M Novel inhibitors of AP-1 and NF-kappaB mediated gene expression: structure-activity relationship studies of ethyl 4-[(3-methyl-2,5-dioxo(3-pyrrolinyl))amino]-2-(trifluoromethyl)++ +pyrimidi ne-5-carboxylate. Bioorg Med Chem Lett10:1645-8 (2000) Protein c-Fos/Transcription factor Jun
Name:Protein c-Fos/Transcription factor Jun
Type:n/a
Mol. Mass.:n/a
Description:ASSAY_ID of EBI is 305353
Components:This complex has 2 components.
Component 1
Name:Transcription factor Jun
Synonyms:AP1 JUN Proto-oncogene c-JUN Transcription factor AP1 p39
Type:n/a
Mol. Mass.:35683.24
Organism:Homo sapiens (Human)
Description:P05412
Residue:331
Component 2
Name:Protein c-Fos
Synonyms:FOS G0S7 | Transcription factor AP1
Type:PROTEIN
Mol. Mass.:40679.34
Organism:Homo sapiens (Human)
Description:EBI_100167
Residue:380
BDBM50090450
NameBDBM50090450
Synonyms:3-Methyl-1-[5-(5-methyl-[1,3,4]oxadiazol-2-yl)-2-thiophen-2-yl-pyrimidin-4-ylamino]-pyrrole-2,5-dione CHEMBL296695
TypeSmall organic molecule
Emp. Form.C16H12N6O3S
Mol. Mass.368.37
SMILESCC1=CC(=O)N(Nc2nc(ncc2-c2nnc(C)o2)-c2cccs2)C1=O