Reaction Details
TargetMu-type opioid receptor
LigandBDBM50060073
Substrate/Competitorn/a
Meas. Tech.ChEMBL_145456 (CHEMBL751089)
EC50<10000±n/a nM
Citation Santagada, VBalboni, GCaliendo, GGuerrini, RSalvadori, SBianchi, CBryant, SDLazarus, LH Assessment of substitution in the second pharmacophore of Dmt-Tic analogues. Bioorg Med Chem Lett10:2745-8 (2000) Mu-type opioid receptor
Name:Mu-type opioid receptor
Type:Enzyme Catalytic Domain
Mol. Mass.:11165.58
Organism:GUINEA PIG
Description:P97266
Residue:98
BDBM50060073
NameBDBM50060073
Synonyms:2-[(S)-2-Amino-3-(4-hydroxy-2,6-dimethyl-phenyl)-propionyl]-1,2,3,4-tetrahydro-isoquinoline-3-carboxylic acid amide 2-[2-amino-3-(4-hydroxy-2,6-dimethylphenyl)-(2S)-propanoyl]-1,2,3,4-tetrahydro-3-isoquinolinecarboxamide | CHEMBL93041
TypeSmall organic molecule
Emp. Form.C21H25N3O3
Mol. Mass.367.4415
SMILESCc1cc(O)cc(C)c1C[C@H](N)C(=O)N1Cc2ccccc2CC1C(N)=O