Reaction Details
TargetDelta-type opioid receptor
LigandBDBM50403821
Substrate/Competitorn/a
Meas. Tech.ChEMBL_146343 (CHEMBL753792)
Ki 0.320000±n/a nM
Citation Santagada, VBalboni, GCaliendo, GGuerrini, RSalvadori, SBianchi, CBryant, SDLazarus, LH Assessment of substitution in the second pharmacophore of Dmt-Tic analogues. Bioorg Med Chem Lett10:2745-8 (2000) Delta-type opioid receptor
Name:Delta-type opioid receptor
Type:Enzyme Catalytic Domain
Mol. Mass.:40577.25
Organism:MOUSE
Description:P32300
Residue:372
BDBM50403821
NameBDBM50403821
Synonyms:CHEMBL93891
TypeSmall organic molecule
Emp. Form.C21H23FN2O4
Mol. Mass.386.4167
SMILESCc1cc(O)cc(C)c1C[C@H](N)C(=O)N1Cc2ccc(F)cc2CC1C(O)=O