Reaction Details
Target5-hydroxytryptamine receptor 6
LigandBDBM50403848
Substrate/Competitorn/a
Meas. Tech.ChEBML_3647
Ki 2±n/a nM
Citation Bromidge, SMClarke, SEGager, TGriffith, KJeffrey, PJennings, AJJoiner, GFKing, FDLovell, PJMoss, SFNewman, HRiley, GRogers, DRoutledge, CSerafinowska, HSmith, DR Phenyl benzenesulfonamides are novel and selective 5-HT6 antagonists: identification of N-(2,5-dibromo-3-fluorophenyl)-4-methoxy-3-piperazin-1-ylbenzenesulfonamide (SB-357134). Bioorg Med Chem Lett11:55-8 (2001) 5-hydroxytryptamine receptor 6
Name:5-hydroxytryptamine receptor 6
Type:G Protein-Coupled Receptor (GPCR)
Mol. Mass.:46968.43
Organism:Homo sapiens (Human)
Description:P50406
Residue:440
BDBM50403848
NameBDBM50403848
Synonyms:CHEMBL346990
TypeSmall organic molecule
Emp. Form.C17H18BrCl2N3O3S
Mol. Mass.495.218
SMILESCOc1ccc(cc1N1CCNCC1)S(=O)(=O)Nc1cc(Cl)cc(Br)c1Cl