Reaction Details
TargetThymidylate synthase
LigandBDBM50403880
Substrate/Competitorn/a
Meas. Tech.ChEBML_209980
Ki 3.5±n/a nM
Citation Bavetsias, VMarriott, JHTheti, DSMelin, JCWilson, SCJackman, AL Cyclopenta[g]quinazoline-based antifolates: the effect of the chirality at the 6-position on the inhibition of thymidylate synthase (TS). Bioorg Med Chem Lett11:3015-7 (2001) Thymidylate synthase
Name:Thymidylate synthase
Type:PROTEIN
Mol. Mass.:34957.15
Organism:Mus musculus
Description:ChEMBL_1340097
Residue:307
BDBM50403880
NameBDBM50403880
Synonyms:CHEMBL317717
TypeSmall organic molecule
Emp. Form.C32H33N5O9
Mol. Mass.631.6325
SMILESCc1nc2cc3CC[C@@H](N(CC#C)c4ccc(cc4)C(=O)N[C@@H](CCC(=O)N[C@H](CCC(O)=O)C(O)=O)C(O)=O)c3cc2c(=O)[nH]1