Reaction Details
TargetAcyl carrier protein,/NADH dehydrogenase [ubiquinone] flavoprotein 1, mitochondrial
LigandBDBM50403902
Substrate/Competitorn/a
Meas. Tech.ChEMBL_141738 (CHEMBL749250)
IC50 0.430000±n/a nM
Citation Tormo, JREstornell, EGallardo, TGonzález, MCCavé, AGranell, SCortes, DZafra-Polo, MC Gamma-lactone-Functionalized antitumoral acetogenins are the most potent inhibitors of mitochondrial complex I. Bioorg Med Chem Lett11:681-4 (2001) Acyl carrier protein,/NADH dehydrogenase [ubiquinone] flavoprotein 1, mitochondrial
Name:Acyl carrier protein,/NADH dehydrogenase [ubiquinone] flavoprotein 1, mitochondrial
Synonyms:Mitochondrial complex I; NADH oxidoreductase
Type:n/a
Mol. Mass.:n/a
Description:ASSAY_ID of EBI is 141738
Components:This complex has 2 components.
Component 1
Name:NADH dehydrogenase [ubiquinone] flavoprotein 1, mitochondrial
Type:PROTEIN
Mol. Mass.:50659.85
Organism:Bos taurus
Description:EBI_100771
Residue:464
Component 2
Name:Acyl carrier protein, mitochondrial
Synonyms:ACP CI-SDAP NDUFAB1
Type:PROTEIN
Mol. Mass.:17397.64
Organism:Bos taurus
Description:ChEMBL_469770
Residue:156
BDBM50403902
NameBDBM50403902
Synonyms:CHEMBL161493
TypeSmall organic molecule
Emp. Form.C37H68O7
Mol. Mass.624.9316
SMILESCCCCCCCCCC[C@H](O)[C@H]1CC[C@H](O1)[C@@H]1CC[C@@H](O1)[C@H](O)CCCCCCCCCC[C@@H](O)CC1C[C@H](C)OC1=O