Reaction Details
TargetIntegrin alpha-V/beta-3
LigandBDBM50107397
Substrate/Competitorn/a
Meas. Tech.ChEMBL_217811 (CHEMBL821718)
IC50 0.350000±n/a nM
Citation Coleman, PJBrashear, KMHunt, CAHoffman, WFHutchinson, JHBreslin, MJMcVean, CAAskew, BCHartman, GDRodan, SBRodan, GALeu, CTPrueksaritanont, TFernandez-Metzler, CMa, BLibby, LAMerkle, KMStump, GLWallace, AALynch, JJLynch, RDuggan, ME Non-peptide alpha(v)beta(3) antagonists. Part 3: identification of potent RGD mimetics incorporating novel beta-amino acids as aspartic acid replacements. Bioorg Med Chem Lett12:31-4 (2001) Integrin alpha-V/beta-3
Name:Integrin alpha-V/beta-3
Type:Enzyme
Mol. Mass.:n/a
Description:n/a
Components:This complex has 2 components.
Component 1
Name:Integrin alpha-V
Synonyms:ITAV_HUMAN Integrin alpha-V/alpha-5 VNRA Vitronectin receptor | Vitronectin receptor subunit alpha
Type:PROTEIN
Mol. Mass.:116024.92
Organism:Homo sapiens (Human)
Description:ChEMBL_582336
Residue:1048
Component 2
Name:Integrin beta-3
Synonyms:CD_antigen=CD61 GPIIIa ITGB3 Platelet membrane glycoprotein IIIa
Type:Protein
Mol. Mass.:87038.91
Organism:Homo sapiens (Human)
Description:P05106
Residue:788
BDBM50107397
NameBDBM50107397
Synonyms:(S)-3-(2-{(S)-2-Oxo-3-[2-(5,6,7,8-tetrahydro-[1,8]naphthyridin-2-yl)-ethyl]-pyrrolidin-1-yl}-acetylamino)-3-pyridin-3-yl-propionic acid 3-(2-{2-Oxo-3-[2-(5,6,7,8-tetrahydro-[1,8]naphthyridin-2-yl)-ethyl]-pyrrolidin-1-yl}-acetylamino)-3-pyridin-3-yl-propionic acid | CHEMBL300008
TypeSmall organic molecule
Emp. Form.C24H29N5O4
Mol. Mass.451.5182
SMILESOC(=O)C[C@H](NC(=O)CN1CC[C@H](CCc2ccc3CCCNc3n2)C1=O)c1cccnc1