Reaction Details
TargetHistamine H3 receptor
LigandBDBM50220430
Substrate/Competitorn/a
Meas. Tech.ChEMBL_86931 (CHEMBL697540)
Ki 1.95±n/a nM
Citation Faghih, RDwight, WBlack, LLiu, HGentles, RPhelan, KEsbenshade, TAIreland, LMiller, TRKang, CHKrueger, KMFox, GBHancock, AABennani, YL Structure-activity relationships of non-imidazole H(3) receptor ligands. Part 2: binding preference for D-amino acids motifs. Bioorg Med Chem Lett12:2035-7 (2002) Histamine H3 receptor
Name:Histamine H3 receptor
Type:G Protein-Coupled Receptor (GPCR)
Mol. Mass.:48607.98
Organism:Rattus norvegicus (rat)
Description:n/a
Residue:445
BDBM50220430
NameBDBM50220430
Synonyms:CHEMBL302829
TypeSmall organic molecule
Emp. Form.C21H31N3O3
Mol. Mass.373.4891
SMILESCC[C@@H](N)C(=O)N1CCN(CCCOc2ccc(cc2)C(=O)C2CC2)CC1