Reaction Details
TargetHistamine H2 receptor
LigandBDBM50220452
Substrate/Competitorn/a
Meas. Tech.ChEMBL_85658 (CHEMBL702650)
Ki 46774±n/a nM
Citation Faghih, RDwight, WBlack, LLiu, HGentles, RPhelan, KEsbenshade, TAIreland, LMiller, TRKang, CHKrueger, KMFox, GBHancock, AABennani, YL Structure-activity relationships of non-imidazole H(3) receptor ligands. Part 2: binding preference for D-amino acids motifs. Bioorg Med Chem Lett12:2035-7 (2002) Histamine H2 receptor
Name:Histamine H2 receptor
Type:G Protein-Coupled Receptor (GPCR)
Mol. Mass.:40115.31
Organism:Homo sapiens (Human)
Description:n/a
Residue:359
BDBM50220452
NameBDBM50220452
Synonyms:CHEMBL60559
TypeSmall organic molecule
Emp. Form.C24H31N3O3S
Mol. Mass.441.586
SMILESN[C@H](Cc1ccsc1)C(=O)N1CCN(CCCOc2ccc(cc2)C(=O)C2CC2)CC1