Reaction Details
TargetHistamine H2 receptor
LigandBDBM50220435
Substrate/Competitorn/a
Meas. Tech.ChEMBL_85658 (CHEMBL702650)
Ki 14125±n/a nM
Citation Faghih, RDwight, WBlack, LLiu, HGentles, RPhelan, KEsbenshade, TAIreland, LMiller, TRKang, CHKrueger, KMFox, GBHancock, AABennani, YL Structure-activity relationships of non-imidazole H(3) receptor ligands. Part 2: binding preference for D-amino acids motifs. Bioorg Med Chem Lett12:2035-7 (2002) Histamine H2 receptor
Name:Histamine H2 receptor
Type:G Protein-Coupled Receptor (GPCR)
Mol. Mass.:40115.31
Organism:Homo sapiens (Human)
Description:n/a
Residue:359
BDBM50220435
NameBDBM50220435
Synonyms:CHEMBL62741
TypeSmall organic molecule
Emp. Form.C25H41N3O3
Mol. Mass.431.6113
SMILESCCCCCC(=O)c1ccc(OCCCN2CCN(CC2)C(=O)[C@H](N)CC(C)C)cc1