Reaction Details
TargetHistamine H2 receptor
LigandBDBM50220437
Substrate/Competitorn/a
Meas. Tech.ChEMBL_85658 (CHEMBL702650)
Ki 89125±n/a nM
Citation Faghih, RDwight, WBlack, LLiu, HGentles, RPhelan, KEsbenshade, TAIreland, LMiller, TRKang, CHKrueger, KMFox, GBHancock, AABennani, YL Structure-activity relationships of non-imidazole H(3) receptor ligands. Part 2: binding preference for D-amino acids motifs. Bioorg Med Chem Lett12:2035-7 (2002) Histamine H2 receptor
Name:Histamine H2 receptor
Type:G Protein-Coupled Receptor (GPCR)
Mol. Mass.:40115.31
Organism:Homo sapiens (Human)
Description:n/a
Residue:359
BDBM50220437
NameBDBM50220437
Synonyms:CHEMBL61792
TypeSmall organic molecule
Emp. Form.C23H31N5O3
Mol. Mass.425.5239
SMILESN[C@H](Cc1c[nH]cn1)C(=O)N1CCN(CCCOc2ccc(cc2)C(=O)C2CC2)CC1