Reaction Details
TargetHistamine H3 receptor
LigandBDBM50220454
Substrate/Competitorn/a
Meas. Tech.ChEMBL_86931 (CHEMBL697540)
Ki 29±n/a nM
Citation Faghih, RDwight, WBlack, LLiu, HGentles, RPhelan, KEsbenshade, TAIreland, LMiller, TRKang, CHKrueger, KMFox, GBHancock, AABennani, YL Structure-activity relationships of non-imidazole H(3) receptor ligands. Part 2: binding preference for D-amino acids motifs. Bioorg Med Chem Lett12:2035-7 (2002) Histamine H3 receptor
Name:Histamine H3 receptor
Type:G Protein-Coupled Receptor (GPCR)
Mol. Mass.:48607.98
Organism:Rattus norvegicus (rat)
Description:n/a
Residue:445
BDBM50220454
NameBDBM50220454
Synonyms:CHEMBL64124
TypeSmall organic molecule
Emp. Form.C21H28N4O3
Mol. Mass.384.472
SMILESN[C@H](CC#N)C(=O)N1CCN(CCCOc2ccc(cc2)C(=O)C2CC2)CC1