Reaction Details
TargetHistamine H2 receptor
LigandBDBM50220423
Substrate/Competitorn/a
Meas. Tech.ChEMBL_85658 (CHEMBL702650)
Ki 26915±n/a nM
Citation Faghih, RDwight, WBlack, LLiu, HGentles, RPhelan, KEsbenshade, TAIreland, LMiller, TRKang, CHKrueger, KMFox, GBHancock, AABennani, YL Structure-activity relationships of non-imidazole H(3) receptor ligands. Part 2: binding preference for D-amino acids motifs. Bioorg Med Chem Lett12:2035-7 (2002) Histamine H2 receptor
Name:Histamine H2 receptor
Type:G Protein-Coupled Receptor (GPCR)
Mol. Mass.:40115.31
Organism:Homo sapiens (Human)
Description:n/a
Residue:359
BDBM50220423
NameBDBM50220423
Synonyms:CHEMBL423666
TypeSmall organic molecule
Emp. Form.C20H27N3O3
Mol. Mass.357.4467
SMILESO=C(C1CC1)c1ccc(OCCCN2CCN(CC2)[C@H]2CC(=O)N2)cc1