Reaction Details
TargetMuscarinic acetylcholine receptor M3
LigandBDBM50403945
Substrate/Competitorn/a
Meas. Tech.ChEMBL_138828 (CHEMBL752410)
Ki 1.6±n/a nM
Citation Diouf, OGadeau, SChellé, FGelbcke, MTalaga, PChristophe, BGillard, MMassingham, RGuyaux, M A new series of M3 muscarinic antagonists based on the 4-amino-piperidine scaffold. Bioorg Med Chem Lett12:2535-9 (2002) Muscarinic acetylcholine receptor M3
Name:Muscarinic acetylcholine receptor M3
Type:Enzyme
Mol. Mass.:66151.03
Organism:Homo sapiens (Human)
Description:P20309
Residue:590
BDBM50403945
NameBDBM50403945
Synonyms:CHEMBL314831
TypeSmall organic molecule
Emp. Form.C23H27BrN2O
Mol. Mass.427.377
SMILESBrc1ccc(cc1)N(C1CCN(Cc2ccccc2)CC1)C(=O)C1CCC1