Reaction Details
TargetMuscarinic acetylcholine receptor M3
LigandBDBM50403940
Substrate/Competitorn/a
Meas. Tech.ChEMBL_138828 (CHEMBL752410)
Ki 1±n/a nM
Citation Diouf, OGadeau, SChellé, FGelbcke, MTalaga, PChristophe, BGillard, MMassingham, RGuyaux, M A new series of M3 muscarinic antagonists based on the 4-amino-piperidine scaffold. Bioorg Med Chem Lett12:2535-9 (2002) Muscarinic acetylcholine receptor M3
Name:Muscarinic acetylcholine receptor M3
Type:Enzyme
Mol. Mass.:66151.03
Organism:Homo sapiens (Human)
Description:P20309
Residue:590
BDBM50403940
NameBDBM50403940
Synonyms:CHEMBL85892
TypeSmall organic molecule
Emp. Form.C25H25BrN2O
Mol. Mass.449.383
SMILESBrc1ccc(cc1)N(C1CCN(Cc2ccccc2)CC1)C(=O)c1ccccc1