Reaction Details
TargetIntegrin alpha-V/beta-3
LigandBDBM50108461
Substrate/Competitorn/a
Meas. Tech.ChEMBL_32966 (CHEMBL644681)
Ki 180±n/a nM
Citation Urbahns, KHärter, MAlbers, MSchmidt, DStelte-Ludwig, BBrüggemeier, UVaupel, AGerdes, C Biphenyls as potent vitronectin receptor antagonists. Bioorg Med Chem Lett12:205-8 (2001) Integrin alpha-V/beta-3
Name:Integrin alpha-V/beta-3
Type:Enzyme
Mol. Mass.:n/a
Description:n/a
Components:This complex has 2 components.
Component 1
Name:Integrin alpha-V
Synonyms:ITAV_HUMAN Integrin alpha-V/alpha-5 VNRA Vitronectin receptor | Vitronectin receptor subunit alpha
Type:PROTEIN
Mol. Mass.:116024.92
Organism:Homo sapiens (Human)
Description:ChEMBL_582336
Residue:1048
Component 2
Name:Integrin beta-3
Synonyms:CD_antigen=CD61 GPIIIa ITGB3 Platelet membrane glycoprotein IIIa
Type:Protein
Mol. Mass.:87038.91
Organism:Homo sapiens (Human)
Description:P05106
Residue:788
BDBM50108461
NameBDBM50108461
Synonyms:3-[3'-(1H-Imidazol-2-ylamino)-biphenyl-3-sulfonylamino]-3-phenyl-propionic acid | CHEMBL67897
TypeSmall organic molecule
Emp. Form.C24H22N4O4S
Mol. Mass.462.521
SMILESOC(=O)CC(NS(=O)(=O)c1cccc(c1)-c1cccc(Nc2ncc[nH]2)c1)c1ccccc1