Reaction Details
TargetIntegrin alpha-V/beta-3
LigandBDBM50108460
Substrate/Competitorn/a
Meas. Tech.ChEMBL_32966 (CHEMBL644681)
Ki 1.4±n/a nM
Citation Urbahns, KHärter, MAlbers, MSchmidt, DStelte-Ludwig, BBrüggemeier, UVaupel, AGerdes, C Biphenyls as potent vitronectin receptor antagonists. Bioorg Med Chem Lett12:205-8 (2001) Integrin alpha-V/beta-3
Name:Integrin alpha-V/beta-3
Type:Enzyme
Mol. Mass.:n/a
Description:n/a
Components:This complex has 2 components.
Component 1
Name:Integrin alpha-V
Synonyms:ITAV_HUMAN Integrin alpha-V/alpha-5 VNRA Vitronectin receptor | Vitronectin receptor subunit alpha
Type:PROTEIN
Mol. Mass.:116024.92
Organism:Homo sapiens (Human)
Description:ChEMBL_582336
Residue:1048
Component 2
Name:Integrin beta-3
Synonyms:CD_antigen=CD61 GPIIIa ITGB3 Platelet membrane glycoprotein IIIa
Type:Protein
Mol. Mass.:87038.91
Organism:Homo sapiens (Human)
Description:P05106
Residue:788
BDBM50108460
NameBDBM50108460
Synonyms:2-{3-[3'-((S)-2-Carboxy-1-phenyl-ethylsulfamoyl)-4'-methoxy-biphenyl-3-yl]-ureido}-3H-benzoimidazol-1-ium
TypeSmall organic molecule
Emp. Form.C30H28N5O6S
Mol. Mass.586.638
SMILESCOc1ccc(cc1S(=O)(=O)N[C@@H](CC(O)=O)c1ccccc1)-c1cccc(NC(=O)Nc2[nH]c3ccccc3[nH+]2)c1