Reaction Details
TargetIntegrin alpha-V/beta-3
LigandBDBM50108456
Substrate/Competitorn/a
Meas. Tech.ChEMBL_32966 (CHEMBL644681)
Ki 30±n/a nM
Citation Urbahns, KHärter, MAlbers, MSchmidt, DStelte-Ludwig, BBrüggemeier, UVaupel, AGerdes, C Biphenyls as potent vitronectin receptor antagonists. Bioorg Med Chem Lett12:205-8 (2001) Integrin alpha-V/beta-3
Name:Integrin alpha-V/beta-3
Type:Enzyme
Mol. Mass.:n/a
Description:n/a
Components:This complex has 2 components.
Component 1
Name:Integrin alpha-V
Synonyms:ITAV_HUMAN Integrin alpha-V/alpha-5 VNRA Vitronectin receptor | Vitronectin receptor subunit alpha
Type:PROTEIN
Mol. Mass.:116024.92
Organism:Homo sapiens (Human)
Description:ChEMBL_582336
Residue:1048
Component 2
Name:Integrin beta-3
Synonyms:CD_antigen=CD61 GPIIIa ITGB3 Platelet membrane glycoprotein IIIa
Type:Protein
Mol. Mass.:87038.91
Organism:Homo sapiens (Human)
Description:P05106
Residue:788
BDBM50108456
NameBDBM50108456
Synonyms:(S)-2-{3'-[3-(1,3-Dihydro-benzoimidazol-2-ylidene)-ureido]-biphenyl-3-sulfonylamino}-3-phenyl-propionic acid | CHEMBL62430
TypeSmall organic molecule
Emp. Form.C29H25N5O5S
Mol. Mass.555.604
SMILESOC(=O)[C@H](Cc1ccccc1)NS(=O)(=O)c1cccc(c1)-c1cccc(NC(=O)Nc2nc3ccccc3[nH]2)c1