Reaction Details
TargetMuscarinic acetylcholine receptor M2
LigandBDBM50076089
Substrate/Competitorn/a
Meas. Tech.ChEBML_138349
Ki 13±n/a nM
Citation Takadoi, MYamaguchi, KTerashima, S Synthesis and muscarinic M(2) subtype antagonistic activity of enantiomeric pairs of 3-demethylhimbacine (3-norhimbacine) and its C(4)-epimer. Bioorg Med Chem Lett12:3271-3 (2002) Muscarinic acetylcholine receptor M2
Name:Muscarinic acetylcholine receptor M2
Type:Enzyme Catalytic Domain
Mol. Mass.:51555.53
Organism:RAT
Description:P10980
Residue:466
BDBM50076089
NameBDBM50076089
Synonyms:(3S,3aR,4R,4aS,8aR,9aS)-3-Methyl-4-[2-((R)-1-methyl-6-(S)-methyl-piperidin-2-yl)-vinyl]-decahydro-naphtho[2,3-c]furan-1-one (3S,3aR,4R,4aS,8aR,9aS)-4-[(E)-2-((2R,6S)-1,6-Dimethyl-piperidin-2-yl)-vinyl]-3-methyl-decahydro-naphtho[2,3-c]furan-1-one 4-[2-(1,6-Dimethyl-piperidin-2-yl)-vinyl]-3-methyl-decahydro-naphtho[2,3-c]furan-1-one CHEMBL277642
TypeSmall organic molecule
Emp. Form.C22H35NO2
Mol. Mass.345.5188
SMILESC[C@@H]1OC(=O)[C@H]2C[C@H]3CCCC[C@@H]3[C@@H](\C=C\[C@H]3CCC[C@H](C)N3C)[C@@H]12