Reaction Details
TargetSubstance-K receptor
LigandBDBM50404025
Substrate/Competitorn/a
Meas. Tech.ChEMBL_209210 (CHEMBL818004)
Ki 0.125893±n/a nM
Citation Harmat, NJGiannotti, DNannicini, RPerrotta, ECriscuoli, MPatacchini, RRenzetti, ARGiuliani, SAltamura, MMaggi, CA Insertion of 2-carboxysuccinate and tricarballylic acid fragments into cyclic-pseudopeptides: new antagonists for the human tachykinin NK-2 receptor. Bioorg Med Chem Lett12:693-6 (2002) Substance-K receptor
Name:Substance-K receptor
Type:Protein
Mol. Mass.:44455.78
Organism:Homo sapiens (Human)
Description:P21452
Residue:398
BDBM50404025
NameBDBM50404025
Synonyms:CHEMBL2112925
TypeSmall organic molecule
Emp. Form.C38H42N6O6
Mol. Mass.678.7767
SMILESO=C(C1CC(=O)N[C@@H](Cc2c[nH]c3ccccc23)C(=O)N[C@@H](Cc2ccccc2)C(=O)N[C@@H](Cc2ccccc2)CNC1=O)N1CCOCC1