Reaction Details
TargetHistidine-rich protein PFHRP-II
LigandBDBM22985
Substrate/Competitorn/a
Meas. Tech.ChEBML_155132
IC50 76500±n/a nM
Citation Ryckebusch, ADeprez-Poulain, RDebreu-Fontaine, MAVandaele, RMouray, EGrellier, PSergheraert, C Synthesis and antimalarial evaluation of new 1,4-bis(3-aminopropyl)piperazine derivatives. Bioorg Med Chem Lett13:3783-7 (2003) Histidine-rich protein PFHRP-II
Name:Histidine-rich protein PFHRP-II
Type:PROTEIN
Mol. Mass.:35156.49
Organism:Plasmodium falciparum
Description:ChEMBL_500704
Residue:332
BDBM22985
NameBDBM22985
Synonyms:Aralen CHLOROQUINE PHOSPHATE Chloroquine med.21724, Compound 8 | {4-[(7-chloroquinolin-4-yl)amino]pentyl}diethylamine
TypeAntimalarial
Emp. Form.C18H26ClN3
Mol. Mass.319.872
SMILESCCN(CC)CCCC(C)Nc1ccnc2cc(Cl)ccc12