Reaction Details
TargetHistamine H3 receptor
LigandBDBM50223046
Substrate/Competitorn/a
Meas. Tech.ChEMBL_86932 (CHEMBL697541)
Ki 219±n/a nM
Citation Faghih, RDwight, WPan, JBFox, GBKrueger, KMEsbenshade, TAMcVey, JMMarsh, KBennani, YLHancock, AA Synthesis and SAR of aminoalkoxy-biaryl-4-carboxamides: novel and selective histamine H3 receptor antagonists. Bioorg Med Chem Lett13:1325-8 (2003) Histamine H3 receptor
Name:Histamine H3 receptor
Type:G Protein-Coupled Receptor (GPCR)
Mol. Mass.:48607.98
Organism:Rattus norvegicus (rat)
Description:n/a
Residue:445
BDBM50223046
NameBDBM50223046
Synonyms:CHEMBL25290
TypeSmall organic molecule
Emp. Form.C25H34N2O2
Mol. Mass.394.5497
SMILESCC(C)NCCCOc1ccc(cc1)-c1ccc(cc1)C(=O)N1[C@@H](C)CC[C@@H]1C