Reaction Details
TargetHistamine H3 receptor
LigandBDBM50223040
Substrate/Competitorn/a
Meas. Tech.ChEMBL_86932 (CHEMBL697541)
Ki 9.1±n/a nM
Citation Faghih, RDwight, WPan, JBFox, GBKrueger, KMEsbenshade, TAMcVey, JMMarsh, KBennani, YLHancock, AA Synthesis and SAR of aminoalkoxy-biaryl-4-carboxamides: novel and selective histamine H3 receptor antagonists. Bioorg Med Chem Lett13:1325-8 (2003) Histamine H3 receptor
Name:Histamine H3 receptor
Type:G Protein-Coupled Receptor (GPCR)
Mol. Mass.:48607.98
Organism:Rattus norvegicus (rat)
Description:n/a
Residue:445
BDBM50223040
NameBDBM50223040
Synonyms:CHEMBL281640
TypeSmall organic molecule
Emp. Form.C26H36N2O2
Mol. Mass.408.5762
SMILESCCN(CC)C(=O)c1ccc(cc1)-c1ccc(OCCCN2CCC(C)CC2)cc1