Reaction Details
TargetHistamine H3 receptor
LigandBDBM50222959
Substrate/Competitorn/a
Meas. Tech.ChEMBL_83795 (CHEMBL692572)
Ki 3.9±n/a nM
Citation Faghih, RDwight, WPan, JBFox, GBKrueger, KMEsbenshade, TAMcVey, JMMarsh, KBennani, YLHancock, AA Synthesis and SAR of aminoalkoxy-biaryl-4-carboxamides: novel and selective histamine H3 receptor antagonists. Bioorg Med Chem Lett13:1325-8 (2003) Histamine H3 receptor
Name:Histamine H3 receptor
Type:G Protein-Coupled Receptor (GPCR)
Mol. Mass.:48691.47
Organism:Homo sapiens (Human)
Description:Binding assays were using CHO cells stably expressing hH3R receptors.
Residue:445
BDBM50222959
NameBDBM50222959
Synonyms:CHEMBL2113224
TypeSmall organic molecule
Emp. Form.C28H39N3O2
Mol. Mass.449.6282
SMILESCC1CCN(CC1)C(=O)c1ccc(cc1)-c1ccc(OCCCN2CC[C@H](C2)N(C)C)cc1