Reaction Details
TargetHistamine H3 receptor
LigandBDBM50222938
Substrate/Competitorn/a
Meas. Tech.ChEMBL_83795 (CHEMBL692572)
Ki 3.5±n/a nM
Citation Faghih, RDwight, WPan, JBFox, GBKrueger, KMEsbenshade, TAMcVey, JMMarsh, KBennani, YLHancock, AA Synthesis and SAR of aminoalkoxy-biaryl-4-carboxamides: novel and selective histamine H3 receptor antagonists. Bioorg Med Chem Lett13:1325-8 (2003) Histamine H3 receptor
Name:Histamine H3 receptor
Type:G Protein-Coupled Receptor (GPCR)
Mol. Mass.:48691.47
Organism:Homo sapiens (Human)
Description:Binding assays were using CHO cells stably expressing hH3R receptors.
Residue:445
BDBM50222938
NameBDBM50222938
Synonyms:CHEMBL25685
TypeSmall organic molecule
Emp. Form.C26H36N2O2
Mol. Mass.408.5762
SMILESCCN(CC)CCCOc1ccc(cc1)-c1ccc(cc1)C(=O)N1CCC(C)CC1