Reaction Details
TargetReverse transcriptase/RNaseH
LigandBDBM50404251
Substrate/Competitorn/a
Meas. Tech.ChEMBL_101642 (CHEMBL710298)
IC50 410±n/a nM
Citation He, YChen, FSun, GWang, YDe Clercq, EBalzarini, JPannecouque, C 5-Alkyl-2-[(aryl and alkyloxylcarbonylmethyl)thio]-6-(1-naphthylmethyl) pyrimidin-4(3H)-ones as an unique HIV reverse transcriptase inhibitors of S-DABO series. Bioorg Med Chem Lett14:3173-6 (2004) 
 
Reverse transcriptase/RNaseH
Name:Reverse transcriptase/RNaseH
Type:PROTEIN
Mol. Mass.:65229.15
Organism:Human immunodeficiency virus 1
Description:ChEMBL_1473730
Residue:566
BDBM50404251
NameBDBM50404251
Synonyms:CHEMBL321980
TypeSmall organic molecule
Emp. Form.C21H22N2O2S
Mol. Mass.366.477
SMILESCC(C)c1c(Cc2cccc3ccccc23)nc(SCC(C)=O)[nH]c1=O