Reaction Details
TargetReverse transcriptase/RNaseH
LigandBDBM50404259
Substrate/Competitorn/a
Meas. Tech.ChEBML_101646
IC50 670±n/a nM
Citation He, YChen, FSun, GWang, YDe Clercq, EBalzarini, JPannecouque, C 5-Alkyl-2-[(aryl and alkyloxylcarbonylmethyl)thio]-6-(1-naphthylmethyl) pyrimidin-4(3H)-ones as an unique HIV reverse transcriptase inhibitors of S-DABO series. Bioorg Med Chem Lett14:3173-6 (2004) 
 
Reverse transcriptase/RNaseH
Name:Reverse transcriptase/RNaseH
Type:PROTEIN
Mol. Mass.:65229.15
Organism:Human immunodeficiency virus 1
Description:ChEMBL_1473730
Residue:566
BDBM50404259
NameBDBM50404259
Synonyms:CHEMBL321026
TypeSmall organic molecule
Emp. Form.C25H22N2O2S
Mol. Mass.414.519
SMILESCc1ccc(cc1)C(=O)CSc1nc(Cc2cccc3ccccc23)c(C)c(=O)[nH]1