Reaction Details
TargetBeta-1 adrenergic receptor
LigandBDBM25761
Substrate/Competitorn/a
Meas. Tech.ChEMBL_39172 (CHEMBL654469)
Kd 8.7±n/a nM
Citation Lalloz, LLoppinet, VCoudert, GGuillaumet, GLoubinoux, BLabrid, CBeaughard, MDureng, GLamar, JC 2-Benzodioxinylaminoethanols: a new class of beta-adrenergic blocking and antihypertensive agents. J Med Chem24:994-8 (1982) Beta-1 adrenergic receptor
Name:Beta-1 adrenergic receptor
Type:Enzyme Catalytic Domain
Mol. Mass.:50540.48
Organism:GUINEA PIG
Description:adrenergic Beta1 ADRB1 GUINEA PIG::B0FL73
Residue:467
BDBM25761
NameBDBM25761
Synonyms:Anapriline CHEMBL27 PROPRANOLOL, d PROPRANOLOL,(+) Propanolol Propranolol | [2-hydroxy-3-(naphthalen-1-yloxy)propyl](propan-2-yl)amine
TypeSmall organic molecule
Emp. Form.C16H21NO2
Mol. Mass.259.3434
SMILESCC(C)NCC(O)COc1cccc2ccccc12