Reaction Details
TargetMalate dehydrogenase, cytoplasmic
LigandBDBM50404702
Substrate/Competitorn/a
Meas. Tech.ChEMBL_52262 (CHEMBL665215)
IC50 81283.05±n/a nM
Citation Coats, EAShah, KJMilstein, SRGenther, CSNene, DMRoesener, JSchmidt, JPleiss, MWagner, EBaker, JK 4-hydroxyquinoline-3-carboxylic acids as inhibitors of cell respiration. 2. Quantitative structure-activity relationship of dehydrogenase enzyme and Ehrlich ascites tumor cell inhibitions. J Med Chem25:57-63 (1982) Malate dehydrogenase, cytoplasmic
Name:Malate dehydrogenase, cytoplasmic
Type:Oxidoreductase; homodimer
Mol. Mass.:36453.77
Organism:Sus scrofa (pig)
Description:Porcine heart cytoplasmic fraction.
Residue:334
BDBM50404702
NameBDBM50404702
Synonyms:CHEMBL160429
TypeSmall organic molecule
Emp. Form.C24H19NO6
Mol. Mass.417.4108
SMILESOC(=O)c1cnc2cc(OCCOc3ccc(Oc4ccccc4)cc3)ccc2c1O