Reaction Details
TargetMalate dehydrogenase, mitochondrial
LigandBDBM50404715
Substrate/Competitorn/a
Meas. Tech.ChEMBL_123822 (CHEMBL733653)
IC50 5128.61±n/a nM
Citation Coats, EAShah, KJMilstein, SRGenther, CSNene, DMRoesener, JSchmidt, JPleiss, MWagner, EBaker, JK 4-hydroxyquinoline-3-carboxylic acids as inhibitors of cell respiration. 2. Quantitative structure-activity relationship of dehydrogenase enzyme and Ehrlich ascites tumor cell inhibitions. J Med Chem25:57-63 (1982) Malate dehydrogenase, mitochondrial
Name:Malate dehydrogenase, mitochondrial
Type:Oxidoreductase; homodimer
Mol. Mass.:35493.48
Organism:Sus scrofa (pig)
Description:Porcine heart mitochondria.
Residue:337
BDBM50404715
NameBDBM50404715
Synonyms:CHEMBL351558
TypeSmall organic molecule
Emp. Form.C18H14BrNO5
Mol. Mass.404.211
SMILESOC(=O)c1cnc2cc(OCCOc3ccc(Br)cc3)ccc2c1O