Reaction Details
TargetMalate dehydrogenase, cytoplasmic
LigandBDBM50404710
Substrate/Competitorn/a
Meas. Tech.ChEMBL_52262 (CHEMBL665215)
IC50 30902.95±n/a nM
Citation Coats, EAShah, KJMilstein, SRGenther, CSNene, DMRoesener, JSchmidt, JPleiss, MWagner, EBaker, JK 4-hydroxyquinoline-3-carboxylic acids as inhibitors of cell respiration. 2. Quantitative structure-activity relationship of dehydrogenase enzyme and Ehrlich ascites tumor cell inhibitions. J Med Chem25:57-63 (1982) Malate dehydrogenase, cytoplasmic
Name:Malate dehydrogenase, cytoplasmic
Type:Oxidoreductase; homodimer
Mol. Mass.:36453.77
Organism:Sus scrofa (pig)
Description:Porcine heart cytoplasmic fraction.
Residue:334
BDBM50404710
NameBDBM50404710
Synonyms:CHEMBL434275
TypeSmall organic molecule
Emp. Form.C23H17NO5
Mol. Mass.387.3848
SMILESOC(=O)c1cnc2cc(OCc3ccc(Oc4ccccc4)cc3)ccc2c1O