Reaction Details
TargetMalate dehydrogenase, cytoplasmic
LigandBDBM50404716
Substrate/Competitorn/a
Meas. Tech.ChEMBL_52262 (CHEMBL665215)
IC50 691830.97±n/a nM
Citation Coats, EAShah, KJMilstein, SRGenther, CSNene, DMRoesener, JSchmidt, JPleiss, MWagner, EBaker, JK 4-hydroxyquinoline-3-carboxylic acids as inhibitors of cell respiration. 2. Quantitative structure-activity relationship of dehydrogenase enzyme and Ehrlich ascites tumor cell inhibitions. J Med Chem25:57-63 (1982) Malate dehydrogenase, cytoplasmic
Name:Malate dehydrogenase, cytoplasmic
Type:Oxidoreductase; homodimer
Mol. Mass.:36453.77
Organism:Sus scrofa (pig)
Description:Porcine heart cytoplasmic fraction.
Residue:334
BDBM50404716
NameBDBM50404716
Synonyms:CHEMBL139402
TypeSmall organic molecule
Emp. Form.C10H8N2O5S
Mol. Mass.268.246
SMILESNS(=O)(=O)c1ccc2c(O)c(cnc2c1)C(O)=O