Reaction Details
TargetMalate dehydrogenase, cytoplasmic
LigandBDBM50404728
Substrate/Competitorn/a
Meas. Tech.ChEMBL_52262 (CHEMBL665215)
IC50 1288249.55±n/a nM
Citation Coats, EAShah, KJMilstein, SRGenther, CSNene, DMRoesener, JSchmidt, JPleiss, MWagner, EBaker, JK 4-hydroxyquinoline-3-carboxylic acids as inhibitors of cell respiration. 2. Quantitative structure-activity relationship of dehydrogenase enzyme and Ehrlich ascites tumor cell inhibitions. J Med Chem25:57-63 (1982) Malate dehydrogenase, cytoplasmic
Name:Malate dehydrogenase, cytoplasmic
Type:Oxidoreductase; homodimer
Mol. Mass.:36453.77
Organism:Sus scrofa (pig)
Description:Porcine heart cytoplasmic fraction.
Residue:334
BDBM50404728
NameBDBM50404728
Synonyms:CHEMBL139078
TypeSmall organic molecule
Emp. Form.C11H7NO5
Mol. Mass.233.177
SMILESOC(=O)c1ccc2c(O)c(cnc2c1)C(O)=O