Reaction Details
TargetCytochrome P450 2B1
LigandBDBM50404852
Substrate/Competitorn/a
Meas. Tech.ChEMBL_35522 (CHEMBL644755)
IC50 26000±n/a nM
Citation Little, PJRyan, AJ Inhibitors of hepatic mixed-function oxidases. 4. Effects of benzimidazole and related compounds on aryl hydrocarbon hydroxylase activity from phenobarbitone and 3-methylcholanthrene induced rats. J Med Chem25:622-6 (1982) Cytochrome P450 2B1
Name:Cytochrome P450 2B1
Type:PROTEIN
Mol. Mass.:55940.51
Organism:Rattus norvegicus
Description:ChEMBL_774167
Residue:491
BDBM50404852
NameBDBM50404852
Synonyms:CHEMBL345675
TypeSmall organic molecule
Emp. Form.C14H20N2
Mol. Mass.216.322
SMILESCCCCCCCc1nc2ccccc2[nH]1